zyrusthc-linux.no-ip.org

A Linux Fan Page .... Shellscripts , Mohaa - Cod2 - Battlefield2 - CS - CSS - ET Webinterface ......

Logo zyrusthc-linux.no-ip.org
Freitag, 14. August 2020
  • Benutzer

  • Besucher
    Heute:
    58
    Gestern:
    98
    Gesamt:
    333.644
  • Benutzer & Gäste
    3668 Benutzer registriert, davon online: 69 Gäste
 
Start Einloggen Einloggen Die Mitglieder Das Foren-Team Suchfunktion
1932 Beiträge & 333 Themen in 13 Foren
Keine neuen Beiträge, seit Ihrem letzten Besuch am 14.08.2020 - 18:13.
  Login speichern
Forenübersicht » Linux » Frage zum remastern Knoppix

vorheriges Thema   nächstes Thema  
19 Beiträge in diesem Thema (offen) Seiten (2): (1) 2 weiter >
Autor
Beitrag
Gast georg68  
Frage zum remastern Knoppix
Gast
Hallo Zyrus,
danke für deinen Tipp mit der zlib1-devel. Habe auf meiner ubuntukiste zlib1g-dev installiert. Leider bekomme ich danach auch wieder ein paar Fehlermeldung. Hänge Sie dir mal mit an. Welche distri. hast du eigentlich für das remastern benutzt? Vielleicht hättest du ja noch ein Tipp für mich?
Gruss Holger

holgi@ubuntu-laptop:~$ sudo /root/remaster.sh stage1
Password:
-e Erstelle Verzeichnisse
mkdir: kann Verzeichnis „/root/remaster“ nicht anlegen: File exists
mkdir: kann Verzeichnis „/root/remaster/KNOPPIX_CD“ nicht anlegen: File exists
mkdir: kann Verzeichnis „/root/remaster/orig_KNOPPIX“ nicht anlegen: File exists
mkdir: kann Verzeichnis „/root/remaster/mein_KNOPPIX“ nicht anlegen: File exists
-e Besorge cloop_2.04-1.tar.gz von http://debian-knoppix.alioth.debian.org ...
--16:25:52-- http://debian-knoppix.alioth.debian.org/sources/cl...4-1.tar .gz
=> `cloop_2.04-1.tar.gz.5'
Auflösen des Hostnamen »debian-knoppix.alioth.debian.org«.... 217.196.43.134
Verbindungsaufbau zu debian-knoppix.alioth.debian.org|217.196.43.134|:80... verbunden.
HTTP Anforderung gesendet, warte auf Antwort... 200 OK
Länge: 484.393 (473K) [application/x-gzip]

100%[====================================>] 484.393 361.32K/s

16:25:54 (360.19 KB/s) - »cloop_2.04-1.tar.gz.5« gespeichert [484393/484393]

-e Entpacke cloop_2.04-1.tar.gz nach /root/remaster/cloop-2.04
-e Kompiliere cloop_2.04-1
cc -I/lib/modules/2.6.20-16-generic/build/include -I/lib/modules/2.6.20-16-generic/build/include/asm/mach-defa ult -D__KERNEL__ -DMODULE -fno-builtin -nostdlib -DKBUILD_MODNAME="cloop" -DKBUILD_BASENAME=\"cloop\" -D__OPTIMIZE__ -DMODVERSIONS -include /lib/modules/2.6.20-16-generic/build/include/config/modversi ons.h -include /lib/modules/2.6.20-16-generic/build/include/linux/version.h -D__SMP__ compressed_loop.c -c -o compressed_loop.o
In file included from /lib/modules/2.6.20-16-generic/build/include/asm/thread_info .h:16,
from /lib/modules/2.6.20-16-generic/build/include/linux/thread_in fo.h:21,
from /lib/modules/2.6.20-16-generic/build/include/linux/preempt.h :9,
from /lib/modules/2.6.20-16-generic/build/include/linux/spinlock. h:49,
from /lib/modules/2.6.20-16-generic/build/include/linux/module.h: 9,
from compressed_loop.c:38:
/lib/modules/2.6.20-16-generic/build/include/asm/processor.h :82: Fehler: »CONFIG_X86_L1_CACHE_SHIFT« ist hier nicht deklariert (nicht in einer Funktion)
/lib/modules/2.6.20-16-generic/build/include/asm/processor.h :82: Fehler: Verlangte Ausrichtung ist keine Konstante
In file included from /lib/modules/2.6.20-16-generic/build/include/linux/sched.h:5 1,
from /lib/modules/2.6.20-16-generic/build/include/linux/utsname.h :35,
from /lib/modules/2.6.20-16-generic/build/include/asm/elf.h:12,
from /lib/modules/2.6.20-16-generic/build/include/linux/elf.h:7,
from /lib/modules/2.6.20-16-generic/build/include/linux/module.h: 15,
from compressed_loop.c:38:
/lib/modules/2.6.20-16-generic/build/include/linux/jiffies.h :33:3: error: #error You lose.
/lib/modules/2.6.20-16-generic/build/include/linux/jiffies.h :225:31: error: division by zero in #if
/lib/modules/2.6.20-16-generic/build/include/linux/jiffies.h :225:31: error: division by zero in #if
/lib/modules/2.6.20-16-generic/build/include/linux/jiffies.h :225:31: error: division by zero in #if
/lib/modules/2.6.20-16-generic/build/include/linux/jiffies.h :225:31: error: division by zero in #if
/lib/modules/2.6.20-16-generic/build/include/linux/jiffies.h :225:31: error: division by zero in #if
/lib/modules/2.6.20-16-generic/build/include/linux/jiffies.h :225:31: error: division by zero in #if
/lib/modules/2.6.20-16-generic/build/include/linux/jiffies.h :225:31: error: division by zero in #if
/lib/modules/2.6.20-16-generic/build/include/linux/jiffies.h :225:31: error: division by zero in #if
/lib/modules/2.6.20-16-generic/build/include/linux/jiffies.h :225:31: error: division by zero in #if
/lib/modules/2.6.20-16-generic/build/include/linux/jiffies.h :225:31: error: division by zero in #if
/lib/modules/2.6.20-16-generic/build/include/linux/jiffies.h :225:31: error: division by zero in #if
/lib/modules/2.6.20-16-generic/build/include/linux/jiffies.h :225:31: error: division by zero in #if
/lib/modules/2.6.20-16-generic/build/include/linux/jiffies.h :225:31: error: division by zero in #if
/lib/modules/2.6.20-16-generic/build/include/linux/jiffies.h :225:31: error: division by zero in #if
/lib/modules/2.6.20-16-generic/build/include/linux/jiffies.h :225:31: error: division by zero in #if
/lib/modules/2.6.20-16-generic/build/include/linux/jiffies.h :225:31: error: division by zero in #if
/lib/modules/2.6.20-16-generic/build/include/linux/jiffies.h :269:46: error: division by zero in #if
In file included from /lib/modules/2.6.20-16-generic/build/include/linux/sched.h:5 1,
from /lib/modules/2.6.20-16-generic/build/include/linux/utsname.h :35,
from /lib/modules/2.6.20-16-generic/build/include/asm/elf.h:12,
from /lib/modules/2.6.20-16-generic/build/include/linux/elf.h:7,
from /lib/modules/2.6.20-16-generic/build/include/linux/module.h: 15,
from compressed_loop.c:38:
/lib/modules/2.6.20-16-generic/build/include/linux/jiffies.h : In Funktion »jiffies_to_msecs«:
/lib/modules/2.6.20-16-generic/build/include/linux/jiffies.h :274: Fehler: »CONFIG_HZ« nicht deklariert (erste Benutzung in dieser Funktion)
/lib/modules/2.6.20-16-generic/build/include/linux/jiffies.h :274: Fehler: (Jeder nicht deklarierte Bezeichner wird nur einmal aufgeführt
/lib/modules/2.6.20-16-generic/build/include/linux/jiffies.h :274: Fehler: für jede Funktion in der er auftritt.)
/lib/modules/2.6.20-16-generic/build/include/linux/jiffies.h :280:46: error: division by zero in #if
/lib/modules/2.6.20-16-generic/build/include/linux/jiffies.h : In Funktion »jiffies_to_usecs«:
/lib/modules/2.6.20-16-generic/build/include/linux/jiffies.h :285: Fehler: »CONFIG_HZ« nicht deklariert (erste Benutzung in dieser Funktion)
/lib/modules/2.6.20-16-generic/build/include/linux/jiffies.h :293:46: error: division by zero in #if
/lib/modules/2.6.20-16-generic/build/include/linux/jiffies.h : In Funktion »msecs_to_jiffies«:
/lib/modules/2.6.20-16-generic/build/include/linux/jiffies.h :298: Fehler: »CONFIG_HZ« nicht deklariert (erste Benutzung in dieser Funktion)
/lib/modules/2.6.20-16-generic/build/include/linux/jiffies.h :306:46: error: division by zero in #if
/lib/modules/2.6.20-16-generic/build/include/linux/jiffies.h : In Funktion »usecs_to_jiffies«:
/lib/modules/2.6.20-16-generic/build/include/linux/jiffies.h :311: Fehler: »CONFIG_HZ« nicht deklariert (erste Benutzung in dieser Funktion)
/lib/modules/2.6.20-16-generic/build/include/linux/jiffies.h : In Funktion »timespec_to_jiffies«:
/lib/modules/2.6.20-16-generic/build/include/linux/jiffies.h :330: Fehler: »CONFIG_HZ« nicht deklariert (erste Benutzung in dieser Funktion)
/lib/modules/2.6.20-16-generic/build/include/linux/jiffies.h :336: Fehler: »SHIFT_HZ« nicht deklariert (erste Benutzung in dieser Funktion)
/lib/modules/2.6.20-16-generic/build/include/linux/jiffies.h : In Funktion »jiffies_to_timespec«:
/lib/modules/2.6.20-16-generic/build/include/linux/jiffies.h :349: Fehler: »CONFIG_HZ« nicht deklariert (erste Benutzung in dieser Funktion)
/lib/modules/2.6.20-16-generic/build/include/linux/jiffies.h : In Funktion »timeval_to_jiffies«:
/lib/modules/2.6.20-16-generic/build/include/linux/jiffies.h :371: Fehler: »CONFIG_HZ« nicht deklariert (erste Benutzung in dieser Funktion)
/lib/modules/2.6.20-16-generic/build/include/linux/jiffies.h :375: Fehler: »SHIFT_HZ« nicht deklariert (erste Benutzung in dieser Funktion)
/lib/modules/2.6.20-16-generic/build/include/linux/jiffies.h : In Funktion »jiffies_to_timeval«:
/lib/modules/2.6.20-16-generic/build/include/linux/jiffies.h :387: Fehler: »CONFIG_HZ« nicht deklariert (erste Benutzung in dieser Funktion)
/lib/modules/2.6.20-16-generic/build/include/linux/jiffies.h :400:6: error: division by zero in #if
/lib/modules/2.6.20-16-generic/build/include/linux/jiffies.h :400:6: error: division by zero in #if
/lib/modules/2.6.20-16-generic/build/include/linux/jiffies.h :400:6: error: division by zero in #if
/lib/modules/2.6.20-16-generic/build/include/linux/jiffies.h :400:6: error: division by zero in #if
/lib/modules/2.6.20-16-generic/build/include/linux/jiffies.h :400:6: error: division by zero in #if
/lib/modules/2.6.20-16-generic/build/include/linux/jiffies.h :400:6: error: division by zero in #if
/lib/modules/2.6.20-16-generic/build/include/linux/jiffies.h :400:6: error: division by zero in #if
/lib/modules/2.6.20-16-generic/build/include/linux/jiffies.h :400:6: error: division by zero in #if
/lib/modules/2.6.20-16-generic/build/include/linux/jiffies.h :400:6: error: division by zero in #if
/lib/modules/2.6.20-16-generic/build/include/linux/jiffies.h :400:6: error: division by zero in #if
/lib/modules/2.6.20-16-generic/build/include/linux/jiffies.h :400:6: error: division by zero in #if
/lib/modules/2.6.20-16-generic/build/include/linux/jiffies.h :400:6: error: division by zero in #if
/lib/modules/2.6.20-16-generic/build/include/linux/jiffies.h :400:6: error: division by zero in #if
/lib/modules/2.6.20-16-generic/build/include/linux/jiffies.h :400:6: error: division by zero in #if
/lib/modules/2.6.20-16-generic/build/include/linux/jiffies.h :400:6: error: division by zero in #if
/lib/modules/2.6.20-16-generic/build/include/linux/jiffies.h :400:6: error: division by zero in #if
/lib/modules/2.6.20-16-generic/build/include/linux/jiffies.h : In Funktion »jiffies_to_clock_t«:
/lib/modules/2.6.20-16-generic/build/include/linux/jiffies.h :401: Fehler: »CONFIG_HZ« nicht deklariert (erste Benutzung in dieser Funktion)
/lib/modules/2.6.20-16-generic/build/include/linux/jiffies.h : In Funktion »clock_t_to_jiffies«:
/lib/modules/2.6.20-16-generic/build/include/linux/jiffies.h :412: Fehler: »CONFIG_HZ« nicht deklariert (erste Benutzung in dieser Funktion)
/lib/modules/2.6.20-16-generic/build/include/linux/jiffies.h :431:6: error: division by zero in #if
/lib/modules/2.6.20-16-generic/build/include/linux/jiffies.h :431:6: error: division by zero in #if
/lib/modules/2.6.20-16-generic/build/include/linux/jiffies.h :431:6: error: division by zero in #if
/lib/modules/2.6.20-16-generic/build/include/linux/jiffies.h :431:6: error: division by zero in #if
/lib/modules/2.6.20-16-generic/build/include/linux/jiffies.h :431:6: error: division by zero in #if
/lib/modules/2.6.20-16-generic/build/include/linux/jiffies.h :431:6: error: division by zero in #if
/lib/modules/2.6.20-16-generic/build/include/linux/jiffies.h :431:6: error: division by zero in #if
/lib/modules/2.6.20-16-generic/build/include/linux/jiffies.h :431:6: error: division by zero in #if
/lib/modules/2.6.20-16-generic/build/include/linux/jiffies.h :431:6: error: division by zero in #if
/lib/modules/2.6.20-16-generic/build/include/linux/jiffies.h :431:6: error: division by zero in #if
/lib/modules/2.6.20-16-generic/build/include/linux/jiffies.h :431:6: error: division by zero in #if
/lib/modules/2.6.20-16-generic/build/include/linux/jiffies.h :431:6: error: division by zero in #if
/lib/modules/2.6.20-16-generic/build/include/linux/jiffies.h :431:6: error: division by zero in #if
/lib/modules/2.6.20-16-generic/build/include/linux/jiffies.h :431:6: error: division by zero in #if
/lib/modules/2.6.20-16-generic/build/include/linux/jiffies.h :431:6: error: division by zero in #if
/lib/modules/2.6.20-16-generic/build/include/linux/jiffies.h :431:6: error: division by zero in #if
/lib/modules/2.6.20-16-generic/build/include/linux/jiffies.h : In Funktion »jiffies_64_to_clock_t«:
/lib/modules/2.6.20-16-generic/build/include/linux/jiffies.h :432: Fehler: »CONFIG_HZ« nicht deklariert (erste Benutzung in dieser Funktion)
In file included from /lib/modules/2.6.20-16-generic/build/include/linux/module.h: 21,
from compressed_loop.c:38:
/lib/modules/2.6.20-16-generic/build/include/asm/module.h:62 :2: error: #error unknown processor family
compressed_loop.c:48:35: error: linux/devfs_fs_kernel.h: No such file or directory
In file included from /lib/modules/2.6.20-16-generic/build/include/linux/highmem.h :5,
from /lib/modules/2.6.20-16-generic/build/include/linux/bio.h:23,
from /lib/modules/2.6.20-16-generic/build/include/linux/loop.h:17 ,
from compressed_loop.c:55:
/lib/modules/2.6.20-16-generic/build/include/linux/mm.h: In Funktion »lowmem_page_address«:
/lib/modules/2.6.20-16-generic/build/include/linux/mm.h:539: Fehler: »CONFIG_PAGE_OFFSET« nicht deklariert (erste Benutzung in dieser Funktion)
In file included from /lib/modules/2.6.20-16-generic/build/include/linux/bio.h:28,
from /lib/modules/2.6.20-16-generic/build/include/linux/loop.h:17 ,
from compressed_loop.c:55:
/lib/modules/2.6.20-16-generic/build/include/asm/io.h: In Funktion »virt_to_phys«:
/lib/modules/2.6.20-16-generic/build/include/asm/io.h:77: Fehler: »CONFIG_PAGE_OFFSET« nicht deklariert (erste Benutzung in dieser Funktion)
/lib/modules/2.6.20-16-generic/build/include/asm/io.h: In Funktion »phys_to_virt«:
/lib/modules/2.6.20-16-generic/build/include/asm/io.h:95: Fehler: »CONFIG_PAGE_OFFSET« nicht deklariert (erste Benutzung in dieser Funktion)
In file included from compressed_loop.c:55:
/lib/modules/2.6.20-16-generic/build/include/linux/loop.h: Auf höchster Ebene:
/lib/modules/2.6.20-16-generic/build/include/linux/loop.h:66 : Fehler: expected specifier-qualifier-list before »request_queue_t«
compressed_loop.c:154: Fehler: expected specifier-qualifier-list before »request_queue_t«
compressed_loop.c:172:2: error: #error "Invalid Kernel configuration. CONFIG_ZLIB_INFLATE support is needed for cloop."
compressed_loop.c:335: Fehler: expected »)« before »*« token
compressed_loop.c: In Funktion »clo_set_file«:
compressed_loop.c:494: Fehler: »request_queue_t« nicht deklariert (erste Benutzung in dieser Funktion)
compressed_loop.c:494: Fehler: »q« nicht deklariert (erste Benutzung in dieser Funktion)
compressed_loop.c:495: Fehler: »struct cloop_device« hat kein Element namens »clo_queue«
compressed_loop.c:496: Fehler: »struct cloop_device« hat kein Element namens »clo_queue«
compressed_loop.c:497: Fehler: »struct cloop_device« hat kein Element namens »clo_queue«
compressed_loop.c:498: Fehler: »struct cloop_device« hat kein Element namens »clo_queue«
compressed_loop.c:499: Fehler: »struct cloop_device« hat kein Element namens »clo_queue«
compressed_loop.c:500: Fehler: »struct cloop_device« hat kein Element namens »clo_queue«
compressed_loop.c:504: Fehler: »struct inode« hat kein Element namens »i_blksize«
compressed_loop.c: In Funktion »cloop_init«:
compressed_loop.c:889: Warnung: Zuweisung erzeugt Zeiger von Ganzzahl ohne Typkonvertierung
compressed_loop.c:893: Fehler: »struct cloop_device« hat kein Element namens »clo_queue«
compressed_loop.c:894: Fehler: »struct cloop_device« hat kein Element namens »clo_queue«
compressed_loop.c:895: Fehler: »struct cloop_device« hat kein Element namens »clo_queue«
compressed_loop.c:895: Fehler: »make_clo_request« nicht deklariert (erste Benutzung in dieser Funktion)
compressed_loop.c:896: Fehler: Dereferenzierung eines Zeigers auf unvollständigen Typen
compressed_loop.c:896: Fehler: »struct cloop_device« hat kein Element namens »clo_queue«
compressed_loop.c:897: Fehler: »struct cloop_device« hat kein Element namens »clo_queue«
compressed_loop.c:898: Fehler: Dereferenzierung eines Zeigers auf unvollständigen Typen
compressed_loop.c:898: Fehler: »struct cloop_device« hat kein Element namens »clo_queue«
compressed_loop.c:899: Fehler: Dereferenzierung eines Zeigers auf unvollständigen Typen
compressed_loop.c:900: Fehler: Dereferenzierung eines Zeigers auf unvollständigen Typen
compressed_loop.c:901: Fehler: Dereferenzierung eines Zeigers auf unvollständigen Typen
compressed_loop.c:902: Fehler: Dereferenzierung eines Zeigers auf unvollständigen Typen
compressed_loop.c:903: Fehler: Dereferenzierung eines Zeigers auf unvollständigen Typen
compressed_loop.c:904: Fehler: Dereferenzierung eines Zeigers auf unvollständigen Typen
compressed_loop.c:929: Fehler: »struct cloop_device« hat kein Element namens »clo_queue«
compressed_loop.c: In Funktion »cloop_exit«:
compressed_loop.c:955: Fehler: »struct cloop_device« hat kein Element namens »clo_queue«
compressed_loop.c: Auf höchster Ebene:
compressed_loop.c:983: Fehler: expected »,« or »;« before »MODULE_PROC_FAMILY«
compressed_loop.c:988: Fehler: Variable »__this_module« hat Initialisierung, aber unvollständigen Typ
compressed_loop.c:989: Fehler: unbekanntes Feld »name« in Initialisierung angegeben
compressed_loop.c:989: Warnung: Elementüberschreitung in struct-Initialisierung
compressed_loop.c:989: Warnung: (nahe der Initialisierung für »__this_module«)
compressed_loop.c:990: Fehler: unbekanntes Feld »init« in Initialisierung angegeben
compressed_loop.c:990: Warnung: Elementüberschreitung in struct-Initialisierung
compressed_loop.c:990: Warnung: (nahe der Initialisierung für »__this_module«)
make: *** [compressed_loop.o] Fehler 1
cp: Aufruf von stat für „cloop.ko“ nicht möglich: No such file or directory
-e Erstelle /dev/cloop ...
-e Legen sie die KNOPPIX CD ein und druecken sie Enter!

mount: block device /dev/hdc is write-protected, mounting read-only
mount: /dev/hdc already mounted or /media/cdrom0 busy
mount: according to mtab, /dev/hdc is already mounted on /media/cdrom0
-e Kopiere CD ...
-e Kopieren der CD Fertig!
-e Lade Kernelmodul cloop.ko
insmod: can't read '/lib/modules/misc/cloop.ko': No such file or directory
mount: /dev/cloop is not a valid block device
-e Temponaeres read-only System nach /root/remaster/mein_KNOPPIX kopieren damit es bearbeitet/veraendert werden kann...
cp: Aufruf von stat für „/root/remaster/orig_KNOPPIX/*“ nicht möglich: No such file or directory
-e Temponaeres System kopiert!
umount: /root/remaster/orig_KNOPPIX: not mounted
ERROR: Module cloop does not exist in /proc/modules
-e Das neue Knoppix ist nun in /root/remaster/mein_KNOPPIX gemountet und kann bearbeitet werden
-e Soll ich /root/remaster/mein_KNOPPIX chrooten, oder wollen sie erst bsp. dep Dateien die sie installieren wollen nach /root/remaster/mein_KNOPPIX kopieren?
-e 1=Automatisch sofort in die chroot Umgebung des Knoppix wechseln.
-e 2=exit-Stage1. dep Dateien erst kopieren und danach manuell chrooten und dann /root/remaster.sh stage2 aufrufen.

Beitrag vom 08.11.2007 - 17:43
Diesen Beitrag melden   zum Anfang der Seite
Zyrusthc ist offline Zyrusthc  
Administrator
712 Beiträge - Alter Hase
Zyrusthc`s alternatives Ego
Hallo georg68

Ich hatte für das remastern die Distribution Mandriva benutzt.

Zu deinen Problem:
Mir ist jetzt diese Fehlermeldung aufgefallen.
compressed_loop.c:172:2: error: #error "Invalid Kernel configuration. CONFIG_ZLIB_INFLATE support is needed for cloop."

Es scheint das bei deinen Kernel "CONFIG_ZLIB_INFLATE" nicht aktiviert ist.
Dies ist aber zwingent erforderlich, damit das cloop Kernelmodul gebaut werden kann.

Überprüfen kannst Du deinen aktuellen Wert mit:
cat /boot/config | grep CONFIG_ZLIB_INFLATE

Dabei sollte "CONFIG_ZLIB_INFLATE=y" rauskommen, also muss es fest in den Kernel.

2.Möglichkeiten hast Du jetzt.
Entwender Du besorgst Dir einen fertigen Kernel bei dem dies aktiviert ist, oder
Du aktivierst diese Option in deiner Kernelkonfiguration und kompilierst und installierst deinen aktuellen Kernel neu.



Greeez Oli
Beitrag vom 08.11.2007 - 17:54
Diesen Beitrag melden   nach weiteren Posts von Zyrusthc suchen Zyrusthc`s Profil ansehen Zyrusthc eine E-Mail senden Zyrusthc eine private Nachricht senden Zyrusthc`s Homepage besuchen Zyrusthc zu Ihren Freunden hinzufügen zum Anfang der Seite
Gast georg68  
Gast
Also wenn ich bei mir cat /boot/config-2.6.20-16-generic | grep CONFIG_ZLIB_INFLATE ausführe bekomme ich CONFIG_ZLIB_INFLATE = y

Heißt das ich den Kernel jetzt kompelieren muß? Was mich als Anfänger doch etwas stresst überrascht ! Oder ist es einfacher sich ein solchen Kernel zu besorgen und zu installieren? Wo würde ich einen solchen bekommen und erkennen das er die nötige konfiguration hat?
Gruß Holger


Dieser Beitrag wurde 1 mal editiert, zuletzt von georg68 am 08.11.2007 - 18:09.
Beitrag vom 08.11.2007 - 18:07
Diesen Beitrag melden   zum Anfang der Seite
Zyrusthc ist offline Zyrusthc  
Administrator
712 Beiträge - Alter Hase
Zyrusthc`s alternatives Ego
Also wenn Du "CONFIG_ZLIB_INFLATE = y" rausbekommen hast dann ist das OK!
Allerdings weiss ich jetzt nicht warum er dann mit dieser Fehlermeldung das kompilieren abbricht?!

Hast Du auch die passende kernel-source zu deinen aktuell laufenden Kernel installiert?
Was sagt den? :
uname -r
ls -l /usr/src
dpkg -l | grep kernel




Greeez Oli
Beitrag vom 08.11.2007 - 18:14
Diesen Beitrag melden   nach weiteren Posts von Zyrusthc suchen Zyrusthc`s Profil ansehen Zyrusthc eine E-Mail senden Zyrusthc eine private Nachricht senden Zyrusthc`s Homepage besuchen Zyrusthc zu Ihren Freunden hinzufügen zum Anfang der Seite
Gast georg68  
Gast
Erst einmal respekt für die schnellen Antworten! grosses Lachen

also uname -r

2.6.20-16-generic

ls -l /usr/src

drwxr-xr-x 20 root root 4096 2007-04-15 13:53 linux-headers-2.6.20-15
drwxr-xr-x 4 root root 4096 2007-04-15 13:53 linux-headers-2.6.20-15-generic
drwxr-xr-x 20 root root 4096 2007-09-28 20:18 linux-headers-2.6.20-16
drwxr-xr-x 4 root root 4096 2007-09-28 20:18 linux-headers-2.6.20-16-generic

dpkg -l | grep kernel

ii kernel-package 10.065ubuntu5 A utility for building Linux kernel related
ii libdrm2 2.3.0-1 Userspace interface to kernel DRM services -
ii linux-generic 2.6.20.16.28.1 Complete Generic Linux kernel
ii linux-headers-2.6.20-15 2.6.20-15.27 Header files related to Linux kernel version
ii linux-headers-2.6.20-15-generic 2.6.20-15.27 Linux kernel headers for version 2.6.20 on x
ii linux-headers-2.6.20-16 2.6.20-16.32 Header files related to Linux kernel version
ii linux-headers-2.6.20-16-generic 2.6.20-16.32 Linux kernel headers for version 2.6.20 on x
ii linux-headers-generic 2.6.20.16.28.1 Generic Linux kernel headers
ii linux-image-2.6.20-15-generic 2.6.20-15.27 Linux kernel image for version 2.6.20 on x86
ii linux-image-2.6.20-16-generic 2.6.20-16.32 Linux kernel image for version 2.6.20 on x86
ii linux-image-generic 2.6.20.16.28.1 Generic Linux kernel image
ii linux-restricted-modules-generic 2.6.20.16.28.1 Restricted Linux modules for generic kernels
ii module-init-tools 3.3-pre3-1ubuntu7 tools for managing Linux kernel modules
ii nvidia-kernel-common 20051028+1ubuntu7 NVIDIA binary kernel module common files
ii udev 108-0ubuntu4 rule-based device node and kernel event mana
Beitrag vom 08.11.2007 - 18:22
Diesen Beitrag melden   zum Anfang der Seite
Zyrusthc ist offline Zyrusthc  
Administrator
712 Beiträge - Alter Hase
Zyrusthc`s alternatives Ego
Wie ich vermutet habe sind nur die header und keine source des kernels installiert!
Installiere linux-source-2.6.20-16 und linux-source-2.6.20-16-generic



Greeez Oli
Beitrag vom 08.11.2007 - 18:25
Diesen Beitrag melden   nach weiteren Posts von Zyrusthc suchen Zyrusthc`s Profil ansehen Zyrusthc eine E-Mail senden Zyrusthc eine private Nachricht senden Zyrusthc`s Homepage besuchen Zyrusthc zu Ihren Freunden hinzufügen zum Anfang der Seite
Gast georg68  
Gast
Also ein paket welches linux-source-2.6.20-16 und linux-source-2.6.20-16-generic heißt findet apt nicht. Wenn ich synaptic verwende finde ich einmal die linux-headers-2.6.20-16 oder aber die linux-image-2.6.20-16-386 und linux-image-2.6.20-16-generic. Sind das bei Ubuntu die Kernelsourcen?
Gruß Holger
Beitrag vom 08.11.2007 - 18:38
Diesen Beitrag melden   zum Anfang der Seite
Zyrusthc ist offline Zyrusthc  
Administrator
712 Beiträge - Alter Hase
Zyrusthc`s alternatives Ego
Ja das sind für Ubuntu die Kernelsourcen.
Suche mal die korreken Paketnamen mit:
sudo apt-cache search linux-source




Greeez Oli
Beitrag vom 08.11.2007 - 18:45
Diesen Beitrag melden   nach weiteren Posts von Zyrusthc suchen Zyrusthc`s Profil ansehen Zyrusthc eine E-Mail senden Zyrusthc eine private Nachricht senden Zyrusthc`s Homepage besuchen Zyrusthc zu Ihren Freunden hinzufügen zum Anfang der Seite
Gast georg68  
Gast
Dann erhalte ich das

xen-source-2.6.16 - Linux kernel source for version 2.6.17 with Ubuntu patches
linux-source - Linux kernel source with Ubuntu patches
linux-source-2.6.20 - Linux kernel source for version 2.6.20 with Ubuntu patches

Beitrag vom 08.11.2007 - 18:49
Diesen Beitrag melden   zum Anfang der Seite
Zyrusthc ist offline Zyrusthc  
RE:
Administrator
712 Beiträge - Alter Hase
Zyrusthc`s alternatives Ego
Zitat
Original geschrieben von georg68

Dann erhalte ich das

xen-source-2.6.16 - Linux kernel source for version 2.6.17 with Ubuntu patches
linux-source - Linux kernel source with Ubuntu patches
linux-source-2.6.20 - Linux kernel source for version 2.6.20 with Ubuntu patches


Dann sollte ein:
sudo apt-get install linux-source-2.6.20
dein Problem lösen....



Greeez Oli
Beitrag vom 08.11.2007 - 18:53
Diesen Beitrag melden   nach weiteren Posts von Zyrusthc suchen Zyrusthc`s Profil ansehen Zyrusthc eine E-Mail senden Zyrusthc eine private Nachricht senden Zyrusthc`s Homepage besuchen Zyrusthc zu Ihren Freunden hinzufügen zum Anfang der Seite
Gast georg68  
Gast
also es wurden die linux-sourcen-2.6.20 eingerichtet. Wenn ich dann alerdings das remaster.sh script ausführe bekomme ich wieder eine Fehlermeldung. Habe ich noch etwas vegessen? Habe die Fehlermeldung bis zu den ersten Fehlern reinkopiert.

holgi@ubuntu-laptop:~$ sudo /root/remaster.sh stage1
-e Erstelle Verzeichnisse
mkdir: kann Verzeichnis „/root/remaster“ nicht anlegen: File exists
mkdir: kann Verzeichnis „/root/remaster/KNOPPIX_CD“ nicht anlegen: File exists
mkdir: kann Verzeichnis „/root/remaster/orig_KNOPPIX“ nicht anlegen: File exists
mkdir: kann Verzeichnis „/root/remaster/mein_KNOPPIX“ nicht anlegen: File exists
-e Besorge cloop_2.04-1.tar.gz von http://debian-knoppix.alioth.debian.org ...
--18:07:21-- http://debian-knoppix.alioth.debian.org/sources/cl...4-1.tar .gz
=> `cloop_2.04-1.tar.gz.6'
Auflösen des Hostnamen »debian-knoppix.alioth.debian.org«.... 217.196.43.134
Verbindungsaufbau zu debian-knoppix.alioth.debian.org|217.196.43.134|:80... verbunden.
HTTP Anforderung gesendet, warte auf Antwort... 200 OK
Länge: 484.393 (473K) [application/x-gzip]

100%[======================================================= ==========================>] 484.393 796.39K/s

18:08:07 (794.53 KB/s) - »cloop_2.04-1.tar.gz.6« gespeichert [484393/484393]

-e Entpacke cloop_2.04-1.tar.gz nach /root/remaster/cloop-2.04
-e Kompiliere cloop_2.04-1
cc -I/lib/modules/2.6.20-16-generic/build/include -I/lib/modules/2.6.20-16-generic/build/include/asm/mach-defa ult -D__KERNEL__ -DMODULE -fno-builtin -nostdlib -DKBUILD_MODNAME="cloop" -DKBUILD_BASENAME=\"cloop\" -D__OPTIMIZE__ -DMODVERSIONS -include /lib/modules/2.6.20-16-generic/build/include/config/modversi ons.h -include /lib/modules/2.6.20-16-generic/build/include/linux/version.h -D__SMP__ compressed_loop.c -c -o compressed_loop.o
In file included from /lib/modules/2.6.20-16-generic/build/include/asm/thread_info .h:16,
from /lib/modules/2.6.20-16-generic/build/include/linux/thread_in fo.h:21,
from /lib/modules/2.6.20-16-generic/build/include/linux/preempt.h :9,
from /lib/modules/2.6.20-16-generic/build/include/linux/spinlock. h:49,
from /lib/modules/2.6.20-16-generic/build/include/linux/module.h: 9,
from compressed_loop.c:38:
/lib/modules/2.6.20-16-generic/build/include/asm/processor.h :82: Fehler: »CONFIG_X86_L1_CACHE_SHIFT« ist hier nicht deklariert (nicht in einer Funktion)
/lib/modules/2.6.20-16-generic/build/include/asm/processor.h :82: Fehler: Verlangte Ausrichtung ist keine Konstante
In file included from /lib/modules/2.6.20-16-generic/build/include/linux/sched.h:5 1,
from /lib/modules/2.6.20-16-generic/build/include/linux/utsname.h :35,
from /lib/modules/2.6.20-16-generic/build/include/asm/elf.h:12,
from /lib/modules/2.6.20-16-generic/build/include/linux/elf.h:7,
from /lib/modules/2.6.20-16-generic/build/include/linux/module.h: 15,
from compressed_loop.c:38:
/lib/modules/2.6.20-16-generic/build/include/linux/jiffies.h :33:3: error: #error You lose.
/lib/modules/2.6.20-16-generic/build/include/linux/jiffies.h :225:31: error: division by zero in #if
/lib/modules/2.6.20-16-generic/build/include/linux/jiffies.h :225:31: error: division by zero in #if
/lib/modules/2.6.20-16-generic/build/include/linux/jiffies.h :225:31: error: division by zero in #if
/lib/modules/2.6.20-16-generic/build/include/linux/jiffies.h :225:31: error: division by zero in #if
/lib/modules/2.6.20-16-generic/build/include/linux/jiffies.h :225:31: error: division by zero in #if
/lib/modules/2.6.20-16-generic/build/include/linux/jiffies.h :225:31: error: division by zero in #if
/lib/modules/2.6.20-16-generic/build/include/linux/jiffies.h :225:31: error: division by zero in #if
/lib/modules/2.6.20-16-generic/build/include/linux/jiffies.h :225:31: error: division by zero in #if
/lib/modules/2.6.20-16-generic/build/include/linux/jiffies.h :225:31: error: division by zero in #if
/lib/modules/2.6.20-16-generic/build/include/linux/jiffies.h :225:31: error: division by zero in #if
/lib/modules/2.6.20-16-generic/build/include/linux/jiffies.h :225:31: error: division by zero in #if
/lib/modules/2.6.20-16-generic/build/include/linux/jiffies.h :225:31: error: division by zero in #if
/lib/modules/2.6.20-16-generic/build/include/linux/jiffies.h :225:31: error: division by zero in #if
/lib/modules/2.6.20-16-generic/build/include/linux/jiffies.h :225:31: error: division by zero in #if
/lib/modules/2.6.20-16-generic/build/include/linux/jiffies.h :225:31: error: division by zero in #if
/lib/modules/2.6.20-16-generic/build/include/linux/jiffies.h :225:31: error: division by zero in #if
/lib/modules/2.6.20-16-generic/build/include/linux/jiffies.h :269:46: error: division by zero in #if
In file included from /lib/modules/2.6.20-16-generic/build/include/linux/sched.h:5 1,
from /lib/modules/2.6.20-16-generic/build/include/linux/utsname.h :35,
from /lib/modules/2.6.20-16-generic/build/include/asm/elf.h:12,
from /lib/modules/2.6.20-16-generic/build/include/linux/elf.h:7,
from /lib/modules/2.6.20-16-generic/build/include/linux/module.h: 15,
from compressed_loop.c:38:
/lib/modules/2.6.20-16-generic/build/include/linux/jiffies.h : In Funktion »jiffies_to_msecs«:
/lib/modules/2.6.20-16-generic/build/include/linux/jiffies.h :274: Fehler: »CONFIG_HZ« nicht deklariert (erste Benutzung in dieser Funktion)
/lib/modules/2.6.20-16-generic/build/include/linux/jiffies.h :274: Fehler: (Jeder nicht deklarierte Bezeichner wird nur einmal aufgeführt
/lib/modules/2.6.20-16-generic/build/include/linux/jiffies.h :274: Fehler: für jede Funktion in der er auftritt.)
/lib/modules/2.6.20-16-generic/build/include/linux/jiffies.h :280:46: error: division by zero in #if
/lib/modules/2.6.20-16-generic/build/include/linux/jiffies.h : In Funktion »jiffies_to_usecs«:
/lib/modules/2.6.20-16-generic/build/include/linux/jiffies.h :285: Fehler: »CONFIG_HZ« nicht deklariert (erste Benutzung in dieser Funktion)
/lib/modules/2.6.20-16-generic/build/include/linux/jiffies.h :293:46: error: division by zero in #if
/lib/modules/2.6.20-16-generic/build/include/linux/jiffies.h : In Funktion »msecs_to_jiffies«:
/lib/modules/2.6.20-16-generic/build/include/linux/jiffies.h :298: Fehler: »CONFIG_HZ« n
Beitrag vom 08.11.2007 - 19:13
Diesen Beitrag melden   zum Anfang der Seite
Zyrusthc ist offline Zyrusthc  
Administrator
712 Beiträge - Alter Hase
Zyrusthc`s alternatives Ego
Hmm , so richtig weiss ich jetzt auch nicht woran es liegt...

Kopiere mal deine aktuelle Kernelconfig von /boot/config nach /usr/src/linux/.config :
cp /boot/config /usr/src/linux/.config
Der "." ist Wichtig!

Und danach dann mal ein :
make oldconfig
in /usr/src/linux ausführen.



Greeez Oli
Beitrag vom 08.11.2007 - 19:22
Diesen Beitrag melden   nach weiteren Posts von Zyrusthc suchen Zyrusthc`s Profil ansehen Zyrusthc eine E-Mail senden Zyrusthc eine private Nachricht senden Zyrusthc`s Homepage besuchen Zyrusthc zu Ihren Freunden hinzufügen zum Anfang der Seite
Gast georg68  
Gast
Muss dir die antwort leider bis morgen schuldig bleiben! Setze mich aber morgen wieder daran!
Gruß Holger
Beitrag vom 08.11.2007 - 20:14
Diesen Beitrag melden   zum Anfang der Seite
Gast georg68  
Gast
Also bei meinem ubunturechner habe ich unter /boot/ zwei config dateien. Einmal config-2.6.20-15-generic und config-2.6.20-16-generic. (Habe auch die verborgenen Dateien eingeblendet). Unter /usr/src/ habe ich dem entsprechend Verzeichnisse linux-headers-2.6.20-15 , linux-headers-2.6.20-15-generic , linux-headers-2.6.20-16 , inux-headers-2.6.20-16-generic und dazu eine kompremierte Datei linux-source-2.6.20.tar.bz2 .
Ich glaube hier stimmt doch etwas nicht, oder? Oder muß das in einer der Linux-header Verzeichnisse kopiert werden. Darin befindet sich ja auch eine .config Datei. Aber in welche der Verzeichnisse?
Gruß Holger
Beitrag vom 09.11.2007 - 12:51
Diesen Beitrag melden   zum Anfang der Seite
Zyrusthc ist offline Zyrusthc  
Administrator
712 Beiträge - Alter Hase
Zyrusthc`s alternatives Ego
Also wenn sich unter /usr/src blos die komprimierte Datei linux-source-2.6.20.tar.bz2 befindet und diese nicht enpackt worden ist dann ist auch klar warum cloop die kernel-sourcen nicht findet.

Zunächst entpacken wir die Datei linux-source-2.6.20.tar.bz2 unter /usr/src :
cd /usr/src
tar xfvj linux-source-2.6.20.tar.bz2


Jetzt erstellen wir noch einen Symbolischen Link linux nach linux-source-2.6.20
ln -s linux-source-2.6.20 linux

Und jetzt kopieren wir die config.
cp /boot/config-2.6.20-16-generic /usr/src/linux/.config

Zu aller letzt dann:
cd /usr/src/linux
make oldconfig



Dann sollte es endlich klappen....



Greeez Oli


Dieser Beitrag wurde 2 mal editiert, zuletzt von Zyrusthc am 09.11.2007 - 14:24.
Beitrag vom 09.11.2007 - 14:23
Diesen Beitrag melden   nach weiteren Posts von Zyrusthc suchen Zyrusthc`s Profil ansehen Zyrusthc eine E-Mail senden Zyrusthc eine private Nachricht senden Zyrusthc`s Homepage besuchen Zyrusthc zu Ihren Freunden hinzufügen zum Anfang der Seite
Baumstruktur - Signaturen verstecken
Seiten (2): (1) 2 weiter > vorheriges Thema   nächstes Thema

Gehe zu:  
Es ist / sind gerade 0 registrierte(r) Benutzer und 69 Gäste online. Neuester Benutzer: Scarez
Mit 3855 Besuchern waren am 02.09.2011 - 14:07 die meisten Besucher gleichzeitig online.
Aktive Themen der letzten 24 Stunden | Foren-Topuser
 
Seite in 0.69440 Sekunden generiert


Diese Website wurde mit PHPKIT WCMS erstellt
PHPKIT ist eine eingetragene Marke der mxbyte GbR © 2002-2009